{"text_format":"1","workbook":"xlsx","n_sheets":5,"sheets":["PLANILHA RESUMO","CRONOGRAMA FISICO-FINANCEIRO","PLANILHA PADRÃO","COMPOSIÇÃO DO BDI","COMPOSIÇÃO DO BDI REDUZIDO"],"not_rendered":{"charts":0,"images":2,"macros":1,"external_links":2,"defined_names":75,"comments":0,"pivot_tables":0},"unopened":[],"bounds":{"document_bytes":16777216,"sheet_cells":100000,"rows_first":2000,"rows_last":500,"rows_between":2000,"halvings":0,"cell_chars":16384,"cell_head_chars":4096},"cells_cut":0,"cells_raw":0,"read":"whole","date_system":"1900"}

{"sheet":"PLANILHA RESUMO","index":0,"n_rows":82,"n_cols":6,"rows_kept":82,"cut":false,"hidden":false,"merged":[[21,1,21,3],[19,1,19,3],[43,1,43,3],[5,1,5,5],[33,1,33,3],[31,1,31,3],[29,1,29,3],[27,1,27,3],[25,1,25,3],[23,1,23,3],[9,0,9,5],[10,0,10,5],[13,1,13,3],[15,1,15,3],[17,1,17,3],[0,0,3,5],[4,0,4,5],[6,0,6,5],[7,0,7,5],[8,0,8,1],[49,1,49,3],[41,1,41,3],[39,1,39,3],[37,1,37,3],[35,1,35,3],[45,1,45,3],[47,1,47,3]]}
["RESUMO PLANILHA ORÇAMENTÁRIA"]
[]
[]
[]
["FIEMT - FEDERAÇÃO DAS INDUSTRIAS DO ESTADO DE MATO GROSSO"]
["OBRA:","CONTRATAÇÃO DE EMPRESA DE ENGENHARIA PARA A REALIZAÇÃO OBRA DE REFORMA DO GABINETE DA SUPERINTENDENCIA, DIRETORIA, RECEPÇÃO, BANHEROS E SALAS DE REUNIÃO."]
["UNIDADE OPERACIONAL: FIEMT"]
["ENDEREÇO: Av. Historiador Rubens de Mendonça, N.4571, Centro Politico Administrativo, Cuiabá - MT. CEP 78.049.940"]
["CONSTRUTORA:"]
["RESPONSÁVEL TÉCNICO:"]
[]
["ITEM","DESCRIÇÃO",null,null,"%","Valor Total (R$)"]
[]
["1.0",{"$f":"VLOOKUP(A14,'PLANILHA PADRÃO'!$1:$1048576,2,0)","v":"ADMINISTRAÇÃO"},null,null,{"$f":"F14/$F$50","v":0.1311693503382915},{"$f":"VLOOKUP(A14,'PLANILHA PADRÃO'!$1:$1048576,6,0)","v":69292.350000000006}]
[]
["1.1",{"$f":"VLOOKUP(A16,'PLANILHA PADRÃO'!$1:$1048576,2,0)","v":"CANTEIRO DE OBRAS"},null,null,{"$f":"F16/$F$50","v":1.9567781644682553E-2},{"$f":"VLOOKUP(A16,'PLANILHA PADRÃO'!$1:$1048576,6,0)","v":10337.000000000002}]
[]
["1.2",{"$f":"VLOOKUP(A18,'PLANILHA PADRÃO'!$1:$1048576,2,0)","v":"MOBILIZAÇÃO E DESMOBILIZAÇÃO CARGA, MANOBRA E DESCARGA DE CONTEINERS"},null,null,{"$f":"F18/$F$50","v":2.2350090386227916E-3},{"$f":"VLOOKUP(A18,'PLANILHA PADRÃO'!$1:$1048576,6,0)","v":1180.68}]
[]
["1.3",{"$f":"VLOOKUP(A20,'PLANILHA PADRÃO'!$1:$1048576,2,0)","v":"DEMOLIÇÕES E RETIRADAS"},null,null,{"$f":"F20/$F$50","v":1.938425678926493E-2},{"$f":"VLOOKUP(A20,'PLANILHA PADRÃO'!$1:$1048576,6,0)","v":10240.050000000001}]
[]
["1.4",{"$f":"VLOOKUP(A22,'PLANILHA PADRÃO'!$1:$1048576,2,0)","v":"ESTRUTURA DE CONCRETO"},null,null,{"$f":"F22/$F$50","v":6.9656153737001443E-4},{"$f":"VLOOKUP(A22,'PLANILHA PADRÃO'!$1:$1048576,6,0)","v":367.97}]
[]
["1.5",{"$f":"VLOOKUP(A24,'PLANILHA PADRÃO'!$1:$1048576,2,0)","v":"ALVENARIAS E PAINÉIS GABINETE SESI/SALA DE ARQUIVO/RECEPÇÃO"},null,null,{"$f":"F24/$F$50","v":2.6793322731610069E-2},{"$f":"VLOOKUP(A24,'PLANILHA PADRÃO'!$1:$1048576,6,0)","v":14154.01}]
[]
["1.6",{"$f":"VLOOKUP(A26,'PLANILHA PADRÃO'!$1:$1048576,2,0)","v":"ESQUADRIAS"},null,null,{"$f":"F26/$F$50","v":8.7572230612771224E-2},{"$f":"VLOOKUP(A26,'PLANILHA PADRÃO'!$1:$1048576,6,0)","v":46261.460000000006}]
[]
["1.7",{"$f":"VLOOKUP(A28,'PLANILHA PADRÃO'!$1:$1048576,2,0)","v":"PISOS"},null,null,{"$f":"F28/$F$50","v":9.2997600149863788E-2},{"$f":"VLOOKUP(A28,'PLANILHA PADRÃO'!$1:$1048576,6,0)","v":49127.5}]
[]
["1.8",{"$f":"VLOOKUP(A30,'PLANILHA PADRÃO'!$1:$1048576,2,0)","v":"REVESTIMENTOS"},null,null,{"$f":"F30/$F$50","v":9.4107381292072537E-2},{"$f":"VLOOKUP(A30,'PLANILHA PADRÃO'!$1:$1048576,6,0)","v":49713.760000000009}]
{"$rows_left_out":53}
{"sheet":"CRONOGRAMA FISICO-FINANCEIRO","index":1,"n_rows":32,"n_cols":12,"rows_kept":32,"cut":false,"hidden":false,"merged":[[0,0,2,1],[0,2,2,7],[0,10,1,11],[3,0,3,11],[4,3,4,10],[4,1,4,2],[10,10,10,11],[5,0,5,2],[6,0,6,2],[7,0,8,11],[10,0,11,0],[10,1,11,1],[10,2,10,3],[10,4,10,5],[10,6,10,7],[10,8,10,9]]}
[null,null,"CRONOGRAMA FÍSICO FINANCEIRO",null,null,null,null,null,null,null,"UNAEN-FF-003"]
[]
[null,null,null,null,null,null,null,null,null,null,"Revisão:\n00","Data:\n11/05/2017"]
["FIEMT - FEDERAÇÃO DAS INDUSTRIAS DO ESTADO DE MATO GROSSO"]
["OBRA:","CONTRATAÇÃO DE EMPRESA DE ENGENHARIA PARA A REALIZAÇÃO OBRA DE REFORMA DO GABINETE DA SUPERINTENDENCIA, DIRETORIA, RECEPÇÃO, BANHEROS E SALAS DE REUNIÃO.",null,"ENDEREÇO: Av. Historiador Rubens de Mendonça, N.4571, Centro Politico Administrativo, Cuiabá - MT. CEP 78.049.940 CIDADE: CUIABÁ-MT"]
["CONSTRUTORA:                                                                           ",null,null,"VALOR:",{"$f":"'PLANILHA RESUMO'!F50","v":528266.32000000007},null,null,"PRAZO: 03 MESES"]
["RESPONSÁVEL TÉCNICO:"]
["GERAL"]
[]
[]
["ITEM","DESCRIÇÃO","ETAPA TOTAL",null,"1 MÊS",null,"2 MESES",null,"3 MESES",null,"TOTAL "]
[null,null,"(R$)","(%)","(R$)","(%)","(R$)","(%)","(R$)","(%)","(R$)","(%)"]
[{"$f":"'PLANILHA PADRÃO'!$A$14","v":"1.0"},{"$f":"VLOOKUP(A13,'PLANILHA PADRÃO'!$1:$1048576,2,0)","v":"ADMINISTRAÇÃO"},{"$f":"'PLANILHA PADRÃO'!$F$14","v":69292.350000000006},{"$f":"C13/$C$31*100","v":13.116935033829149},{"$f":"F13*$C13/100","v":13179.40497},19.02,{"$f":"H13*$C13/100","v":34632.316529999996},49.98,{"$f":"J13*$C13/100","v":21480.628500000006},{"$f":"100-F13-H13","v":31.000000000000007},{"$f":"L13*$C13/100","v":69292.350000000006},{"$f":"F13+H13+J13","v":100}]
[{"$f":"'PLANILHA PADRÃO'!$A$21","v":"1.1"},{"$f":"VLOOKUP(A14,'PLANILHA PADRÃO'!$1:$1048576,2,0)","v":"CANTEIRO DE OBRAS"},{"$f":"'PLANILHA PADRÃO'!$F$21","v":10337.000000000002},1.9567781644682554,3445.6666666666674,{"$f":"100/3","v":33.333333333333336},3445.6666666666674,{"$f":"100/3","v":33.333333333333336},3445.6666666666674,{"$f":"100/3","v":33.333333333333336},10337.000000000002,{"$f":"F14+H14+J14","v":100}]
[{"$f":"'PLANILHA PADRÃO'!$A$29","v":"1.2"},{"$f":"VLOOKUP(A15,'PLANILHA PADRÃO'!$1:$1048576,2,0)","v":"MOBILIZAÇÃO E DESMOBILIZAÇÃO CARGA, MANOBRA E DESCARGA DE CONTEINERS"},{"$f":"'PLANILHA PADRÃO'!$F$29","v":1180.68},0.22350090386227917,590.34,50,590.34,50,0,null,1180.68,100]
[{"$f":"'PLANILHA PADRÃO'!$A$33","v":"1.3"},{"$f":"VLOOKUP(A16,'PLANILHA PADRÃO'!$1:$1048576,2,0)","v":"DEMOLIÇÕES E RETIRADAS"},{"$f":"'PLANILHA PADRÃO'!$F$33","v":10240.050000000001},1.9384256789264931,10240.050000000001,100,0,null,0,null,10240.050000000001,100]
[{"$f":"'PLANILHA PADRÃO'!$A$77","v":"1.4"},{"$f":"VLOOKUP(A17,'PLANILHA PADRÃO'!$1:$1048576,2,0)","v":"ESTRUTURA DE CONCRETO"},{"$f":"'PLANILHA PADRÃO'!$F$77","v":367.97},6.9656153737001444E-2,0,null,367.97,100,0,null,367.97,100]
[{"$f":"'PLANILHA PADRÃO'!$A$85","v":"1.5"},{"$f":"VLOOKUP(A18,'PLANILHA PADRÃO'!$1:$1048576,2,0)","v":"ALVENARIAS E PAINÉIS GABINETE SESI/SALA DE ARQUIVO/RECEPÇÃO"},{"$f":"'PLANILHA PADRÃO'!$F$85","v":14154.01},2.6793322731610067,4246.2029999999995,30,9907.8070000000007,70,0,null,14154.01,100]
[{"$f":"'PLANILHA PADRÃO'!$A$92","v":"1.6"},{"$f":"VLOOKUP(A19,'PLANILHA PADRÃO'!$1:$1048576,2,0)","v":"ESQUADRIAS"},{"$f":"'PLANILHA PADRÃO'!$F$92","v":46261.460000000006},8.7572230612771218,0,null,23130.730000000003,50,23130.730000000003,50,46261.460000000006,100]
[{"$f":"'PLANILHA PADRÃO'!$A$107","v":"1.7"},{"$f":"VLOOKUP(A20,'PLANILHA PADRÃO'!$1:$1048576,2,0)","v":"PISOS"},{"$f":"'PLANILHA PADRÃO'!$F$107","v":49127.5},9.2997600149863793,0,null,9825.5,20,39302,80,49127.5,100]
[{"$f":"'PLANILHA PADRÃO'!$A$115","v":"1.8"},{"$f":"VLOOKUP(A21,'PLANILHA PADRÃO'!$1:$1048576,2,0)","v":"REVESTIMENTOS"},{"$f":"'PLANILHA PADRÃO'!$F$115","v":49713.760000000009},9.4107381292072532,14914.128000000002,30,34799.632000000005,70,0,null,49713.760000000009,100]
[{"$f":"'PLANILHA PADRÃO'!$A$130","v":"1.9"},{"$f":"VLOOKUP(A22,'PLANILHA PADRÃO'!$1:$1048576,2,0)","v":"FORRO"},{"$f":"'PLANILHA PADRÃO'!$F$130","v":26498.640000000003},5.0161517016644179,0,null,26498.640000000003,100,0,null,26498.640000000003,100]
[{"$f":"'PLANILHA PADRÃO'!$A$134","v":"1.10"},{"$f":"VLOOKUP(A23,'PLANILHA PADRÃO'!$1:$1048576,2,0)","v":"PINTURA"},{"$f":"'PLANILHA PADRÃO'!$F$134","v":18525.05},3.5067634067604381,0,null,5557.5150000000003,30,12967.535,70,18525.05,100]
[{"$f":"'PLANILHA PADRÃO'!$A$146","v":"1.11"},{"$f":"VLOOKUP(A24,'PLANILHA PADRÃO'!$1:$1048576,2,0)","v":"INSTALAÇÃO DE ÁGUA FRIA, ESGOTO E DRENAGEM"},{"$f":"'PLANILHA PADRÃO'!$F$146","v":2574.0999999999995},{"$f":"C24/$C$31*100","v":0.48727316176431595},{"$f":"F24*$C24/100","v":1801.8699999999997},70,{"$f":"H24*$C24/100","v":772.2299999999999},30,0,null,{"$f":"L24*$C24/100","v":2574.0999999999995},100]
[{"$f":"'PLANILHA PADRÃO'!$A$172","v":"1.12"},{"$f":"VLOOKUP(A25,'PLANILHA PADRÃO'!$1:$1048576,2,0)","v":"INSTALAÇÕES ELÉTRICA DE BAIXA TENSÃO"},{"$f":"'PLANILHA PADRÃO'!$F$172","v":144094.67999999996},27.276900787466435,36023.669999999991,25,72047.339999999982,50,36023.669999999991,25,144094.67999999996,100]
[{"$f":"'PLANILHA PADRÃO'!$A$295","v":"1.13"},{"$f":"VLOOKUP(A26,'PLANILHA PADRÃO'!$1:$1048576,2,0)","v":"LOGICA E TELEFONICA"},{"$f":"'PLANILHA PADRÃO'!$F$295","v":39043.119999999995},7.3908024270788246,9760.7799999999988,25,25378.027999999998,65,3904.3119999999994,10,39043.119999999995,100]
[{"$f":"'PLANILHA PADRÃO'!$A$319","v":"1.14"},{"$f":"VLOOKUP(A27,'PLANILHA PADRÃO'!$1:$1048576,2,0)","v":"CLIMATIZAÇÃO - AR CONDICIONADO"},{"$f":"'PLANILHA PADRÃO'!$F$319","v":4802.66},0.90913613421351547,0,null,4802.66,100,0,null,4802.66,100]
[{"$f":"'PLANILHA PADRÃO'!$A$332","v":"1.15"},{"$f":"VLOOKUP(A28,'PLANILHA PADRÃO'!$1:$1048576,2,0)","v":"INFRAESTRUTURA PARA INSTALAÇÃO DE AUDIO E VÍDEO"},{"$f":"'PLANILHA PADRÃO'!$F$332","v":20443.830000000002},3.8699855027668617,6133.1490000000003,30,10221.915000000001,50,4088.7660000000005,20,20443.830000000002,100]
[{"$f":"'PLANILHA PADRÃO'!$A$345","v":"1.16"},{"$f":"VLOOKUP(A29,'PLANILHA PADRÃO'!$1:$1048576,2,0)","v":"LOUÇAS E METÁIS"},{"$f":"'PLANILHA PADRÃO'!$F$345","v":21311.539999999997},{"$f":"C29/$C$31*100","v":4.0342416681040723},{"$f":"F29*$C29/100","v":0},null,{"$f":"H29*$C29/100","v":2131.1539999999995},10,19180.385999999999,90,{"$f":"L29*$C29/100","v":21311.539999999994},100]
[{"$f":"'PLANILHA PADRÃO'!$A$366","v":"1.17"},{"$f":"VLOOKUP(A30,'PLANILHA PADRÃO'!$1:$1048576,2,0)","v":"LIMPEZA FINAL PARA ENTREGA"},{"$f":"'PLANILHA PADRÃO'!$F$366","v":297.92},5.6395796726166444E-2,null,null,0,null,297.92,100,297.92,100]
{"$rows_left_out":3}
{"sheet":"PLANILHA PADRÃO","index":2,"n_rows":369,"n_cols":32,"rows_kept":369,"cut":false,"hidden":false,"merged":[[4,0,4,5],[7,0,7,5],[6,0,6,5],[8,0,8,5],[5,1,5,5],[0,3,1,5],[2,3,3,3],[2,4,3,4],[2,5,3,5],[0,0,3,2]]}
["                                 PLANILHA ORÇAMENTARIA   ",null,null,"SPN-FF-003",null,null,null,null,null,null,null,"C:\\Users\\alexandre.seba\\OneDrive - SFIEMT\\UNAEN\\1.ENGENHARIA SESI SENAI\\01.UO\\03.CONDOMÍNIO.FIEMT\\2022.12.05_REFORMA_GDR_SUPERINT\\ANEXO I.B - PLANILHA ORÇAMENTÁRIA\\BASE-DADOS-SINAPI-10-2022.xlsx"]
[]
[null,null,null,"Folha:              1 de 1","Revisão:      \n02","Data: \n07/10/19"]
[]
["FIEMT - FEDERAÇÃO DAS INDUSTRIAS DO ESTADO DE MATO GROSSO"]
["OBRA: ","CONTRATAÇÃO DE EMPRESA DE ENGENHARIA PARA A REALIZAÇÃO OBRA DE REFORMA DO GABINETE DA SUPERINTENDENCIA, DIRETORIA, RECEPÇÃO, BANHEROS E SALAS DE REUNIÃO."]
["UNIDADE OPERACIONAL: FIEMT"]
["ENDEREÇO:  Av. Historiador Rubens de Mendonça, N.4571, Centro Politico Administrativo, Cuiabá - MT. CEP 78.049.940       \nCIDADE: CUIABÁ - MT"]
["CONSTRUTORA:",null,null,null,null,null,null,"BDI DIFERENCIADO:",{"$f":"BDI_EQUI","v":0.14610000000000001}]
["RESPONSÁVEL TÉCNICO:",null,null,"REF.:",{"$f":"LEFT(RIGHT(CAMINHO_DO_BD,19),14)","v":"SINAPI-10-2022"},null,null,"BDI:",{"$f":"BDI","v":0.2235},"SINAPI REF.",{"$f":"LEFT(RIGHT(CAMINHO_DO_BD,12),7)","v":"10-2022"}]
[]
["ITEM","DESCRIÇÃO","UNID.","QUANT.","Valor UNIT. (R$)","Valor Total (R$)",null,"CÓDIGO","ORIGEM/OBSERVAÇÃO","Valor Unit. (R$) SEM BDI","Valor Unit. (R$)\nC/ BDI",null,"TIPO DO ITEM","TIPO DO BDI"]
[]
["1.0","ADMINISTRAÇÃO",null,null,null,{"$f":"SUBTOTAL(9,F15:F20)","v":69292.350000000006}]
[{"$f":"$A$14&\".\"&(ROW(A15)-ROW($A$14))","v":"1.0.1"},"ENGENHEIRO CIVIL DE OBRA PLENO COM ENCARGOS COMPLEMENTARES \n02 HORAS X 5 DIAS X3 meses","H",120,{"$f":"K15","v":143.41},{"$f":"ROUND(D15*E15,2)","v":17209.2},null,"90778",{"$f":"IF(M15=\"COMPOSIÇÃO\",LEFT(RIGHT(CAMINHO_DO_BD,19),14),IF(M15=\"INSUMO\",\"INSUMO \" & LEFT(RIGHT(CAMINHO_DO_BD,19),14),IF(M15=\"COMPOSIÇÃO PRÓPRIA\",\"COMPOSIÇÃO PRÓPRIA COM BASE NA \" & LEFT(RIGHT(CAMINHO_DO_BD,19),14),\"PREÇO MÉDIO DE ORÇAMENTOS\")))","v":"SINAPI-10-2022"},117.21,{"$f":"ROUND(J15*(1+BDI),2)","v":143.41},null,"COMPOSIÇÃO","BDI DE OBRA"]
[{"$f":"$A$14&\".\"&(ROW(A16)-ROW($A$14))","v":"1.0.2"},"ENGENHEIRO ELETRICISTA COM ENCARGOS COMPLEMENTARES\n02 HORAS X 5 DIAS X3 meses","H",120,{"$f":"K16","v":122.29},{"$f":"ROUND(D16*E16,2)","v":14674.8},null,"91677",{"$f":"IF(M16=\"COMPOSIÇÃO\",LEFT(RIGHT(CAMINHO_DO_BD,19),14),IF(M16=\"INSUMO\",\"INSUMO \" & LEFT(RIGHT(CAMINHO_DO_BD,19),14),IF(M16=\"COMPOSIÇÃO PRÓPRIA\",\"COMPOSIÇÃO PRÓPRIA COM BASE NA \" & LEFT(RIGHT(CAMINHO_DO_BD,19),14),\"PREÇO MÉDIO DE ORÇAMENTOS\")))","v":"SINAPI-10-2022"},99.95,{"$f":"ROUND(J16*(1+BDI),2)","v":122.29},null,"COMPOSIÇÃO","BDI DE OBRA"]
[{"$f":"$A$14&\".\"&(ROW(A17)-ROW($A$14))","v":"1.0.3"},"ENCARREGADO GERAL DE OBRAS COM ENCARGOS COMPLEMENTARES","MES",3,{"$f":"K17","v":6144.75},{"$f":"ROUND(D17*E17,2)","v":18434.25},null,"93572",{"$f":"IF(M17=\"COMPOSIÇÃO\",LEFT(RIGHT(CAMINHO_DO_BD,19),14),IF(M17=\"INSUMO\",\"INSUMO \" & LEFT(RIGHT(CAMINHO_DO_BD,19),14),IF(M17=\"COMPOSIÇÃO PRÓPRIA\",\"COMPOSIÇÃO PRÓPRIA COM BASE NA \" & LEFT(RIGHT(CAMINHO_DO_BD,19),14),\"PREÇO MÉDIO DE ORÇAMENTOS\")))","v":"SINAPI-10-2022"},5022.2700000000004,{"$f":"ROUND(J17*(1+BDI),2)","v":6144.75},null,"COMPOSIÇÃO","BDI DE OBRA"]
[{"$f":"$A$14&\".\"&(ROW(A18)-ROW($A$14))","v":"1.0.4"},"TÉCNICO EM SEGURANÇA DO TRABALHO COM ENCARGOS COMPLEMENTARES","MES",3,{"$f":"K18","v":6133.88},{"$f":"ROUND(D18*E18,2)","v":18401.64},null,"100321",{"$f":"IF(M18=\"COMPOSIÇÃO\",LEFT(RIGHT(CAMINHO_DO_BD,19),14),IF(M18=\"INSUMO\",\"INSUMO \" & LEFT(RIGHT(CAMINHO_DO_BD,19),14),IF(M18=\"COMPOSIÇÃO PRÓPRIA\",\"COMPOSIÇÃO PRÓPRIA COM BASE NA \" & LEFT(RIGHT(CAMINHO_DO_BD,19),14),\"PREÇO MÉDIO DE ORÇAMENTOS\")))","v":"SINAPI-10-2022"},5013.3900000000003,{"$f":"ROUND(J18*(1+BDI),2)","v":6133.88},null,"COMPOSIÇÃO","BDI DE OBRA"]
[{"$f":"$A$14&\".\"&(ROW(A19)-ROW($A$14))","v":"1.0.5"},"ANOTAÇÃO DE RESPONSABILIDADE TÉCNICA DE EXECUÇÃO","UN",2,{"$f":"K19","v":286.23},{"$f":"ROUND(D19*E19,2)","v":572.46},null,"C_CIV0326",{"$f":"IF(M19=\"COMPOSIÇÃO\",LEFT(RIGHT(CAMINHO_DO_BD,19),14),IF(M19=\"INSUMO\",\"INSUMO \" & LEFT(RIGHT(CAMINHO_DO_BD,19),14),IF(M19=\"COMPOSIÇÃO PRÓPRIA\",\"COMPOSIÇÃO PRÓPRIA COM BASE NA \" & LEFT(RIGHT(CAMINHO_DO_BD,19),14),\"PREÇO MÉDIO DE ORÇAMENTOS\")))","v":"COMPOSIÇÃO PRÓPRIA COM BASE NA SINAPI-10-2022"},233.94,{"$f":"ROUND(J19*(1+BDI),2)","v":286.23},null,"COMPOSIÇÃO PRÓPRIA","BDI DE OBRA"]
[]
["1.1","CANTEIRO DE OBRAS",null,null,null,{"$f":"SUBTOTAL(9,F22:F28)","v":10337.000000000002}]
[{"$f":"$A$21&\".\"&(ROW(A22)-ROW($A$21))","v":"1.1.1"},"LOCACAO DE CONTAINER 2,30 X 6,00 M, ALT. 2,50 M, COM 1 SANITARIO, PARA ESCRITORIO, COMPLETO, SEM DIVISORIAS INTERNAS (NAO INCLUI MOBILIZACAO/DESMOBILIZACAO)                                                                                                                                                                                                                                                                                                                                              ","MES   ",3,{"$f":"K22","v":1052.21},{"$f":"ROUND(D22*E22,2)","v":3156.63},null,10775,{"$f":"IF(M22=\"COMPOSIÇÃO\",LEFT(RIGHT(CAMINHO_DO_BD,19),14),IF(M22=\"INSUMO\",\"INSUMO \" & LEFT(RIGHT(CAMINHO_DO_BD,19),14),IF(M22=\"COMPOSIÇÃO PRÓPRIA\",\"COMPOSIÇÃO PRÓPRIA COM BASE NA \" & LEFT(RIGHT(CAMINHO_DO_BD,19),14),\"PREÇO MÉDIO DE ORÇAMENTOS\")))","v":"INSUMO SINAPI-10-2022"},860,{"$f":"ROUND(J22*(1+BDI),2)","v":1052.21},null,"INSUMO","BDI DE OBRA"]
[{"$f":"$A$21&\".\"&(ROW(A23)-ROW($A$21))","v":"1.1.2"},"LOCACAO DE CONTAINER 2,30 X 6,00 M, ALT. 2,50 M, PARA ALMOXARIFADO, SEM DIVISORIAS INTERNAS E SEM SANITARIO                                                                                                                                                                                                                                                                                                                                                       ","MES   ",3,822.03,2466.09,null,10776,"INSUMO SINAPI-10-2022",671.87,822.03,null,"INSUMO","BDI DE OBRA"]
["1.1.3","LOCAÇÃO MENSAL INCLUSIVE FRETE BEBEDOURO ELÉTRICO TEMPERATURA NATURAL OU GELADA.","MES",3,390.19,1170.57,null,"C_CIV0149","COMPOSIÇÃO PRÓPRIA COM BASE NA SINAPI-10-2022",318.91000000000003,390.19,null,"COMPOSIÇÃO PRÓPRIA","BDI DE OBRA"]
["1.1.4","LOCACAO DE ANDAIME METALICO TUBULAR DE ENCAIXE, TIPO DE TORRE, CADA PAINEL COM LARGURA DE 1 ATE 1,5 M E ALTURA DE *1,00* M, INCLUINDO DIAGONAL, BARRAS DE LIGACAO, SAPATAS OU RODIZIOS E DEMAIS ITENS NECESSARIOS A MONTAGEM","MXMES ",24,{"$f":"K25","v":29.36},704.64,null,10527,"INSUMO SINAPI-10-2022",24,29.36,null,"INSUMO","BDI DE OBRA"]
[{"$f":"$A$21&\".\"&(ROW(A26)-ROW($A$21))","v":"1.1.5"},"TAPUME COM TELHA METÁLICA. AF_05/2018","M2",18.959999999999997,{"$f":"K26","v":130.4},2472.38,"C_CIV0327","98459","SINAPI-10-2022",106.58,130.4,null,"COMPOSIÇÃO","BDI DE OBRA"]
[{"$f":"$A$21&\".\"&(ROW(A27)-ROW($A$21))","v":"1.1.6"},"PLANO MENSAL DE INTERNET","MÊS",3,{"$f":"K27","v":122.23},366.69,"C_CIV0327","C_CIV0327","COMPOSIÇÃO PRÓPRIA COM BASE NA SINAPI-10-2022",99.9,122.23,null,"COMPOSIÇÃO PRÓPRIA","BDI DE OBRA"]
[]
["1.2","MOBILIZAÇÃO E DESMOBILIZAÇÃO CARGA, MANOBRA E DESCARGA DE CONTEINERS",null,null,null,{"$f":"SUBTOTAL(9,F30:F32)","v":1180.68}]
[{"$f":"$A$29&\".\"&(ROW(A30)-ROW($A$29))","v":"1.2.1"},"TRANSPORTE COM CAMINHÃO CARROCERIA COM GUINDAUTO (MUNCK),  MOMENTO MÁXIMO DE CARGA 11,7 TM, EM VIA URBANA PAVIMENTADA, DMT ATÉ 30KM (UNIDADE: TXKM). AF_07/2020\n2 TONELADAS X 3 CONTEINERS X 30KM (20KM IDA E 20KM VOLTA)","TXKM",240,{"$f":"K30","v":3.33},{"$f":"ROUND(D30*E30,2)","v":799.2},null,"100952",{"$f":"IF(M30=\"COMPOSIÇÃO\",LEFT(RIGHT(CAMINHO_DO_BD,19),14),IF(M30=\"INSUMO\",\"INSUMO \" & LEFT(RIGHT(CAMINHO_DO_BD,19),14),IF(M30=\"COMPOSIÇÃO PRÓPRIA\",\"COMPOSIÇÃO PRÓPRIA COM BASE NA \" & LEFT(RIGHT(CAMINHO_DO_BD,19),14),\"PREÇO MÉDIO DE ORÇAMENTOS\")))","v":"SINAPI-10-2022"},2.72,{"$f":"ROUND(J30*(1+BDI),2)","v":3.33},null,"COMPOSIÇÃO","BDI DE OBRA"]
{"$rows_left_out":340}
{"sheet":"COMPOSIÇÃO DO BDI","index":3,"n_rows":29,"n_cols":4,"rows_kept":29,"cut":false,"hidden":false,"merged":[[1,0,4,2],[27,0,27,1],[28,0,42,2],[5,0,5,1],[6,0,6,1],[10,0,10,1],[18,0,18,1]]}
[]
["COMPOSIÇÃO DO BDI OBRAS DE ENGENHARIA        "]
[]
[]
[]
["DESCRIÇÃO",null,"%"]
["GRUPO A"]
["A1","(AC) ADMINISTRAÇÃO CENTRAL - VARIA CONFORME O PORTE DA NÚMERO DE OBRAS EM ANDAMENTO, VOLUME FINANCEIRO DAS OBRAS A INICIAREM, ETC,  EM CADA   EM CADA EMPRESA - (ACORDAO 2622/2013 - 3,0% A 5,5%)",{"$f":"ROUND(AVERAGE(3%,5.5%),4)","v":4.2500000000000003E-2}]
[null,"TOTAL DO GRUPO A  =",{"$f":"SUM(C8)","v":4.2500000000000003E-2}]
[]
["GRUPO B"]
["B1","(DF) DESPESAS FINANCEIRAS - (ACORDAO 2622/2013 - 0,59% A 1,39%)",{"$f":"ROUND(AVERAGE(0.59%,1.39%),4)","v":9.9000000000000008E-3},"***deve estar dentro da média dos ultimos 3 meses antecedentes ao contrato"]
["B2","(S)   SEGUROS - (ACORDAO 2622/2013 SEGURO + GARANTIA - 0,8% A 1,0%)",{"$f":"ROUND(AVERAGE(0.4%,0.5%),4)","v":4.4999999999999997E-3}]
["B2","(G)   GARANTIAS - (ACORDAO 2622/2013 SEGURO + GARANTIA - 0,8% A 1,0%)",{"$f":"ROUND(AVERAGE(0.4%,0.5%),4)","v":4.4999999999999997E-3}]
["B3","(R)   TAXA DE RISCO E IMPREVISTOS - (ACORDAO 2622/2013 0,97% A 1,27%)",{"$f":"ROUND(AVERAGE(0.97%,1.27%),4)","v":1.12E-2}]
["B4","(L)    LUCRO (ACORDAO 2622/2013 6,16% A 8,96%)",{"$f":"ROUND(AVERAGE(6.16%,8.96%),4)","v":7.5600000000000001E-2}]
[null,"TOTAL DO GRUPO B  =",{"$f":"SUM(C12:C16)","v":0.1057}]
[]
["GRUPO C"]
["C1","ISS - (ISS% SOBRE 40% DE MÃO DE OBRA)"]
["C2","%MÃO DE OBRA",0.4]
["C3","ISS DO MUNICÍPIO",0.05]
["C4","SUBTOTAL ISS (C2 X C3) =",{"$f":"C22*C21","v":2.0000000000000004E-2}]
["C5","PIS",6.4999999999999997E-3]
["C6","COFINS",0.03]
[null,"TOTAL DO GRUPO C  =",{"$f":"SUM(C23:C25)","v":5.6500000000000002E-2}]
[]
["TOTAL BDI (FORMULA ACORDAO 2369/2011)",null,{"$f":"ROUND((1+C8+C13+C15+C14)*(1+C12)*(1+C16)/(1-C26)-1,4)","v":0.2235}]
[" BDI = (1+AC+S+R+G)x(1+DF)X(1+L))  -1\n                                  1-I\nOnde: \nAC = taxa representativa das despesas de rateio da Administração Central;\nS = taxa representativa de Seguros;\nR = taxa representativa de Riscos;\nG = taxa representativa de Garantias;\nDF = taxa representativa das Despesas Financeiras;\nL = taxa representativa do Lucro;\nI = taxa representativa da incidência de Impostos. \n\n  Observação:\n  i)   Composição do BDI, intervalos admissíveis e Fórmula de cálculo nos termos do Acórdão 2622/2013 do TCU."]

{"sheet":"COMPOSIÇÃO DO BDI REDUZIDO","index":4,"n_rows":29,"n_cols":3,"rows_kept":29,"cut":false,"hidden":false,"merged":[[28,0,42,2],[1,0,4,2],[5,0,5,1],[6,0,6,1],[10,0,10,1],[18,0,18,1],[27,0,27,1]]}
[]
["COMPOSIÇÃO DO BDI REDUZIDO                       "]
[]
[]
[]
["DESCRIÇÃO",null,"%"]
["GRUPO A"]
["A1","(AC) ADMINISTRAÇÃO CENTRAL - VARIA CONFORME O PORTE DA NÚMERO DE OBRAS EM ANDAMENTO, VOLUME FINANCEIRO DAS OBRAS A INICIAREM, ETC,  EM CADA   EM CADA EMPRESA - (ACORDAO 2622/2013 - 1,5% A 4,49%)",{"$f":"ROUND(AVERAGE(1.5%,4.49%),4)","v":0.03}]
[null,"TOTAL DO GRUPO A  =",{"$f":"SUM(C8)","v":0.03}]
[]
["GRUPO B"]
["B1","(DF) DESPESAS FINANCEIRAS - (ACORDAO 2622/2013 - 0,85% A 1,11%)",{"$f":"ROUND(AVERAGE(0.85%,1.11%),4)","v":9.7999999999999997E-3}]
["B2","(S)   SEGUROS - (ACORDAO 2622/2013 SEGURO + GARANTIA - 0,3% A 0,82%)",{"$f":"ROUND(AVERAGE(0.3%/2,0.82%/2),4)","v":2.8E-3}]
["B2","(G)   GARANTIAS - (ACORDAO 2622/2013 SEGURO + GARANTIA - 0,3% A 0,82%)",{"$f":"ROUND(AVERAGE(0.3%/2,0.82%/2),4)","v":2.8E-3}]
["B3","(R)   TAXA DE RISCO E IMPREVISTOS - (ACORDAO 2622/2013 0,56% A 0,89%)",{"$f":"ROUND(AVERAGE(0.56%,0.89%),4)","v":7.3000000000000001E-3}]
["B4","(L)    LUCRO (ACORDAO 2622/2013 3,50% A 6,22%)",{"$f":"ROUND(AVERAGE(3.5%,6.22%),4)","v":4.8599999999999997E-2}]
[null,"TOTAL DO GRUPO B  =",{"$f":"SUM(C12:C16)","v":7.1300000000000002E-2}]
[]
["GRUPO C"]
["C1","ISS - (ISS% SOBRE 40% DE MÃO DE OBRA)"]
["C2","%MÃO DE OBRA",0]
["C3","ISS DO MUNICÍPIO",0.05]
["C4","SUBTOTAL ISS (C2 X C3) =",{"$f":"C22*C21","v":0}]
["C5","PIS",6.4999999999999997E-3]
["C6","COFINS",0.03]
[null,"TOTAL DO GRUPO C  =",{"$f":"SUM(C23:C25)","v":3.6499999999999998E-2}]
[]
["TOTAL BDI (ACORDAO 2369/2011)",null,{"$f":"ROUND((1+C8+C13+C15+C14)*(1+C12)*(1+C16)/(1-C26)-1,4)","v":0.14610000000000001}]
[" BDI = (1+AC+S+R+G)x(1+DF)X(1+L))  -1\n                                  1-I\nOnde: \nAC = taxa representativa das despesas de rateio da Administração Central;\nS = taxa representativa de Seguros;\nR = taxa representativa de Riscos;\nG = taxa representativa de Garantias;\nDF = taxa representativa das Despesas Financeiras;\nL = taxa representativa do Lucro;\nI = taxa representativa da incidência de Impostos. \n\n  Observação:\n  i)   Composição do BDI, intervalos admissíveis e Fórmula de cálculo nos termos do Acórdão 2622/2013 do TCU."]